{"text_format":"1","workbook":"xlsx","n_sheets":5,"sheets":["記入例","本紙","別紙１繰越事由一覧","別紙2繰越審査必要書類","予算科目、財源区分"],"not_rendered":{"charts":0,"images":1,"macros":1,"external_links":0,"defined_names":2,"comments":2,"pivot_tables":0},"unopened":[],"bounds":{"document_bytes":16777216,"sheet_cells":100000,"rows_first":2000,"rows_last":500,"rows_between":2000,"halvings":0,"cell_chars":16384,"cell_head_chars":4096},"cells_cut":0,"cells_raw":0,"read":"whole","date_system":"1900"}

{"sheet":"記入例","index":0,"n_rows":43,"n_cols":28,"rows_kept":43,"cut":false,"hidden":false,"merged":[[4,17,26,19],[8,22,8,23],[0,0,0,26],[1,25,1,26],[2,0,3,1],[2,2,3,3],[2,4,3,8],[2,9,3,10],[2,11,3,13],[2,14,2,19],[2,20,3,21],[2,22,3,26],[3,14,3,16],[3,17,3,19],[20,0,20,1],[1,0,1,5],[31,21,36,21],[31,22,36,22],[4,20,26,21],[4,22,4,23],[5,0,12,1],[5,4,9,8],[5,22,7,26],[10,22,10,26],[12,4,16,8],[13,22,26,26],[15,0,15,1],[19,4,23,8],[4,2,26,3],[4,9,26,10],[4,11,26,13],[4,14,26,16],[35,1,35,2],[36,1,36,2],[31,23,36,23],[27,0,27,26],[28,0,28,26],[29,0,30,2],[29,3,29,14],[29,15,29,26],[31,0,36,0],[31,1,31,2],[31,15,36,15],[31,16,36,16],[31,17,36,17],[31,18,36,18],[31,19,36,19],[31,20,36,20],[8,27,8,28],[13,27,14,28],[8,24,8,26],[37,0,42,0],[37,1,37,2],[38,1,38,2],[39,1,39,2],[40,1,40,2],[41,1,41,2],[42,1,42,2],[31,24,36,24],[31,25,36,25],[31,26,36,26],[32,1,32,2],[33,1,33,2],[34,1,34,2]]}
["箇所別調書及び理由書(翌債承認に係るもの)"]
["（目）医療研究開発推進事業費補助金",null,null,null,null,null,null,null,null,null,null,null,null,null,null,null,null,null,null,null,null,null,null,null,null,"（単位：円）"]
["事項",null,"機関名",null,"事業概要",null,null,null,null,"（当初計画）\n変更計画",null,"交付・契約額",null,null,"左の額の支出見込み内訳",null,null,null,null,null,"事業完了\n予定年月日",null,"事由"]
[null,null,null,null,null,null,null,null,null,null,null,null,null,null,"本年度",null,null,"翌年度"]
["課題名",null,"学校法人AMED大学",null,"研究目的",null,null,null,null,"下記参照",null,10000000,null,null,6500000,null,null,3500000,null,null,"2022-12-31",null,"繰越事由",null,null,null,null,{"$f":"IF(L5=O5+R5,\"\",\"「交付・契約額」と「左の額の支出見込額内訳」が合致しません。\")","v":""}]
["○○に関する実証研究",null,null,null,null,null,null,null,null,null,null,null,null,null,null,null,null,null,null,null,null,null,"①キ　計画に関する諸条件（その他（内容））"]
[]
[]
[null,null,null,null,null,null,null,null,null,null,null,null,null,null,null,null,null,null,null,null,null,null,{"$f":"VLOOKUP(W6,別紙１繰越事由一覧!C:E,3,FALSE)","v":"(その他)の内容："}]
[null,null,null,null,null,null,null,null,null,null,null,null,null,null,null,null,null,null,null,null,null,null,"繰越事由の発生した時期："]
[null,null,null,null,null,null,null,null,null,null,null,null,null,null,null,null,null,null,null,null,null,null,"令和X年10月"]
[null,null,null,null,"研究手法"]
[null,null,null,null,null,null,null,null,null,null,null,null,null,null,null,null,null,null,null,null,null,null,"繰越事由詳細"]
[null,null,null,null,null,null,null,null,null,null,null,null,null,null,null,null,null,null,null,null,null,null,"実証研究に必要な機器（・・・・・）について年度内に納入する予定であったが、予備実験結果により、当初予定していた設備では十分な解析ができず仕様の検討に時間を要したため、計画を変更せざるを得ず、年度内に事業を完了することが困難となったため"]
["AMED課題管理番号"]
["21XX1122333h0001"]
[]
[]
[null,null,null,null,"目指す成果"]
["補助金の財源"]
["厚生労働省（当初･医療）"]
[]
[]
[]
[]
[]
[]
[]
["当初計画及計画"]
["計画",null,null,"令和X年度(202n年度）",null,null,null,null,null,null,null,null,null,null,null,"令和X+1年度(202n+1年度）"]
[null,null,null,"4月","5月","6月","7月","8月","9月","10月","11月","12月","1月","2月","3月","4月","5月","6月","7月","8月","9月","10月","11月","12月","1月","2月","3月"]
["当\n初","事前調査",null,null,null,"","","","","","","","","",""]
[null,"○○調査の実施"]
[null,"調査結果の分析"]
[null,"学会発表及び研究成果とりまとめ"]
[null,""]
[null,""]
["変\n更\n後","事前調査",null,null,null,"","","","","","","","","","","","","","","","","","","","","",""]
[null,"○○調査の実施",null,null,null,"","","","","","","","","","","","","","","","","","","","","",""]
[null,"調達機器の仕様の変更",null,null,null,"","","","","","","","","","","","","","","","","","","","","",""]
[null,"調査結果の分析",null,null,null,"","","","","","","","","","","","","","","","","","","","","",""]
[null,"学会発表及び研究成果とりまとめ",null,null,null,"","","","","","","","","","","","","","","","","","","","","",""]
[null,"",null,null,null,"","","","","","","","","","","","","","","","","","","","","",""]

{"sheet":"本紙","index":1,"n_rows":38,"n_cols":28,"rows_kept":38,"cut":false,"hidden":false,"merged":[[18,0,18,1],[34,1,34,2],[35,1,35,2],[36,1,36,2],[29,3,29,14],[31,1,31,2],[19,4,23,8],[28,0,28,26],[29,0,30,2],[31,0,36,0],[32,1,32,2],[33,1,33,2],[2,0,3,1],[2,2,3,3],[27,0,27,26],[2,11,3,13],[4,11,26,13],[2,9,3,10],[4,9,26,10],[4,22,4,23],[5,22,7,26],[10,22,10,26],[2,22,3,26],[2,20,3,21],[12,4,16,8],[13,22,26,26],[15,0,15,1],[5,0,12,1],[42,1,42,2],[37,0,42,0],[38,1,38,2],[39,1,39,2],[40,1,40,2],[41,1,41,2],[37,1,37,2],[8,24,8,26],[29,15,29,26],[31,17,36,17],[31,18,36,18],[31,19,36,19],[31,16,36,16],[31,15,36,15],[31,20,36,20],[31,21,36,21],[31,22,36,22],[31,23,36,23],[31,24,36,24],[31,25,36,25],[31,26,36,26],[1,0,1,5],[9,22,9,26],[4,0,4,1],[4,4,4,8],[0,0,0,26],[1,25,1,26],[5,4,9,8],[2,4,3,8],[4,2,26,3],[4,20,26,21],[2,14,2,19],[3,14,3,16],[3,17,3,19],[4,14,26,16],[4,17,26,19],[8,22,8,23]]}
["箇所別調書及び理由書(翌債承認に係るもの)"]
["（目）医療研究開発推進事業費補助金",null,null,null,null,null,null,null,null,null,null,null,null,null,null,null,null,null,null,null,null,null,null,null,null,"（単位：円）"]
["事項",null,"研究機関名",null,"事業概要",null,null,null,null,"（当初計画）\n変更計画",null,"交付・契約額",null,null,"左の額の支出見込み内訳",null,null,null,null,null,"事業完了\n予定年月日",null,"事由"]
[null,null,null,null,null,null,null,null,null,null,null,null,null,null,"本年度",null,null,"翌年度"]
["課題名",null,null,null,"研究目的",null,null,null,null,"下記参照",null,null,null,null,null,null,null,null,null,null,null,null,"繰越事由",null,null,null,null,{"$f":"IF(L5=O5+R5,\"\",\"「交付・契約額」と「左の額の支出見込額内訳」が合致しません。\")","v":""}]
[null,null,null,null,null,null,null,null,null,null,null,null,null,null,null,null,null,null,null,null,null,null,"①キ　計画に関する諸条件（新たな知見の発見）"]
[]
[]
[null,null,null,null,null,null,null,null,null,null,null,null,null,null,null,null,null,null,null,null,null,null,{"$f":"VLOOKUP(W6,別紙１繰越事由一覧!C:E,3,FALSE)","v":""},null,null,null,null,{"$f":"VLOOKUP(W6,別紙１繰越事由一覧!C:F,4,FALSE)","v":""}]
[null,null,null,null,null,null,null,null,null,null,null,null,null,null,null,null,null,null,null,null,null,null,"繰越事由の発生した時期"]
[]
[null,null,null,null,"研究手法"]
[null,null,null,null,null,null,null,null,null,null,null,null,null,null,null,null,null,null,null,null,null,null,"繰越事由詳細"]
[]
["AMED課題管理番号"]
[]
[]
["補助金の財源"]
["総務省（当初･医療）",null,null,null,"目指す成果"]
[]
[]
[]
[]
[]
[]
[]
[]
[]
["当初計画及計画"]
["計画",null,null,"令和X年度(202n年度）",null,null,null,null,null,null,null,null,null,null,null,"令和X+1年度(202n+1年度）"]
[null,null,null,"4月","5月","6月","7月","8月","9月","10月","11月","12月","1月","2月","3月","4月","5月","6月","7月","8月","9月","10月","11月","12月","1月","2月","3月"]
["当\n初"]
[]
[]
[]
[]
[]
["変\n更\n後"]

{"sheet":"別紙１繰越事由一覧","index":2,"n_rows":23,"n_cols":6,"rows_kept":23,"cut":false,"hidden":false,"merged":[[6,1,15,1],[16,1,22,1],[2,1,2,2]]}
["別紙１　繰越事由一覧（記号等）"]
[]
[null,"繰越事由一覧（記号等）は、下表の通りとしますので最も適切な小区分を１つ選択してください。"]
[]
[null,"大区分","小区分（記号等）",null,null,{"$f":"\"\"","v":""}]
[null,null,"選択して下さい。","「繰越事由」を選択して下さい。",{"$f":"\"\"","v":""},{"$f":"\"\"","v":""}]
[null,"具体的な内容を記載する必要がある事由\n※以下の事由（記号等）については、具体的な内容の記載をすること","①キ　計画に関する諸条件（新たな知見の発見）","←繰越事由の具体的な内容を記載して下さい。",{"$f":"\"\"","v":""},{"$f":"\"\"","v":""}]
[null,null,"①キ　計画に関する諸条件（研究協力者の確保難）","←繰越事由の具体的な内容を記載して下さい。",{"$f":"\"\"","v":""},{"$f":"\"\"","v":""}]
[null,null,"①キ　計画に関する諸条件（装置の開発遅延）","←繰越事由の具体的な内容を記載して下さい。",{"$f":"\"\"","v":""},{"$f":"\"\"","v":""}]
[null,null,"①キ　計画に関する諸条件（機器の故障）","←繰越事由の具体的な内容を記載して下さい。",{"$f":"\"\"","v":""},{"$f":"\"\"","v":""}]
[null,null,"①キ　計画に関する諸条件（その他（内容））","←繰越事由の具体的な内容を記載して下さい。","(その他)の内容：","←(その他)の内容を記載して下さい。例：調達機器の仕様変更"]
[null,null,"⑥エ　資材の入手難（納期遅延）","←繰越事由の具体的な内容を記載して下さい。",{"$f":"\"\"","v":""},{"$f":"\"\"","v":""}]
[null,null,"⑥オ　資材の入手難（マウス等実験動物の確保難）","←繰越事由の具体的な内容を記載して下さい。",{"$f":"\"\"","v":""},{"$f":"\"\"","v":""}]
[null,null,"⑥オ　資材の入手難（資材及び資料の入手難）","←繰越事由の具体的な内容を記載して下さい。",{"$f":"\"\"","v":""},{"$f":"\"\"","v":""}]
[null,null,"⑥オ　資材の入手難（その他（内容））","←繰越事由の具体的な内容を記載して下さい。","(その他)の内容：","←(その他)の内容を記載して下さい。"]
[null,null,"⑦ウ　試験研究に際しての事前調査又は研究方式の決定の困難（その他（内容））","←繰越事由の具体的な内容を記載して下さい。","(その他)の内容：","←(その他)の内容を記載して下さい。"]
[null,"具体的な内容を記載する必要がない事由\n※事由（記号等）のみを記載","①エ 計画に関する諸条件（計画の変更）","←空欄のままとして下さい。",{"$f":"\"\"","v":""},{"$f":"\"\"","v":""}]
[null,null,"③ア 気象の関係（豪雨）","←空欄のままとして下さい。",{"$f":"\"\"","v":""},{"$f":"\"\"","v":""}]
[null,null,"③イ 気象の関係（豪雪）","←空欄のままとして下さい。",{"$f":"\"\"","v":""},{"$f":"\"\"","v":""}]
[null,null,"③ウ 気象の関係（風浪）","←空欄のままとして下さい。",{"$f":"\"\"","v":""},{"$f":"\"\"","v":""}]
[null,null,"③エ 気象の関係（その他）","←空欄のままとして下さい。",{"$f":"\"\"","v":""},{"$f":"\"\"","v":""}]
[null,null,"⑦ア 試験研究に際しての事前調査又は研究方式の決定の困難（事前調査の困難）","←空欄のままとして下さい。",{"$f":"\"\"","v":""},{"$f":"\"\"","v":""}]
[null,null,"⑦イ 試験研究に際しての事前調査又は研究方式の決定の困難（研究方式の決定の困難）","←空欄のままとして下さい。",{"$f":"\"\"","v":""},{"$f":"\"\"","v":""}]

{"sheet":"別紙2繰越審査必要書類","index":3,"n_rows":10,"n_cols":3,"rows_kept":10,"cut":false,"hidden":false,"merged":[[2,1,2,2]]}
["別紙2　繰越審査必要書類"]
[]
[null,"繰越の要否の判断にあたって、下記の事項を確認できる書類の提出を求めることがあります。提出書類の例はあくまで例示であり、これ以外の書類を求めることもあります。"]
[]
[null,"確認事項","提出書類の例"]
[null,"繰越事由及び事由発生時期が妥当であることが確認できる書類","所属機関からの在宅勤務・自宅待機に関する通知\n遅延証明書、気象証明書\n業者からの変更申出書"]
[null,"「本年度分」の支出見込み額の内訳が確認できる書類","経費等内訳書"]
[null,"「翌年度分」の支出見込み額の内訳が確認できる書類","経費等内訳書"]
[null,"事業に関連した外注業務の完了日が確認できる書類","遅延証明書\n業者からの変更申出書"]
[null,"事業の完了の見込み年月日が確認できる書類","遅延証明書\n業者からの変更申出書"]

{"sheet":"予算科目、財源区分","index":4,"n_rows":23,"n_cols":2,"rows_kept":23,"cut":false,"hidden":false,"merged":[]}
[]
[]
[null,"予算科目"]
[null,"（目）医療研究開発推進事業費補助金"]
[null,"（目）保健衛生医療調査等推進事業費補助金"]
[null,"（目）中小企業医療研究開発推進事業費補助金"]
[]
[]
[null,"財源区分一覧"]
[null,"総務省（当初･医療）"]
[null,"文部科学省（当初･一般・医療）"]
[null,"文部科学省（補正・一般・医療）"]
[null,"文部科学省（調整費･一般・医療）"]
[null,"厚生労働省（当初･医療）"]
[null,"厚生労働省（当初･保衛）"]
[null,"厚生労働省（補正・医療）"]
[null,"厚生労働省（補正・保衛）"]
[null,"厚生労働省（調整費･医療）"]
[null,"経済産業省（当初･研発）"]
[null,"経済産業省（当初･中小）"]
[null,"経済産業省（補正・研発）"]
[null,"経済産業省（調整費・研発）"]
[null,"経済産業省（予備費・研発）"]